Home > Cannot Open > Usr/bin/ld Cannot Open Output File Git Is A Directory

Usr/bin/ld Cannot Open Output File Git Is A Directory

Contents

We recommend upgrading to the latest Safari, Google Chrome, or Firefox. Everything is fine now. I don't know what is causing the problem. This allow building specs in release mode in a much faster way. his comment is here

cmd/dist # Building compilers and Go bootstrap tool for host, darwin/amd64. Personal Open source Business Explore Sign up Sign in Pricing Blog Support Search GitHub This repository Watch 38 Star 99 Fork 867 cryptonotefoundation/cryptonote forked from amjuarez/bytecoin Code Issues 7 Pull How exactly should I change permission for the directory? –DigiSweep May 15 '14 at 22:20 @DigiSweep: Sorry for the late reply. If you need that feature, add it to config.

/usr/bin/ld Cannot Open Output File Permission Denied

Suggest : CXX=g++-4.9 cmake ../ ... Maybe it's trying to link to the wrong shared object. –Benjamin Toueg Jan 3 '13 at 17:58 I just tried make clean and now it comes up with another Kaeltis commented on 2016-03-31 18:54 The bintray caching error can be fixed by adding "--disable-bintray_cache" to the ./configure line. You can change all the permissions and owner of the current folder recursively with this command pair: sudo chown -R $USER:$USER .; chmod -R o+rw . –Helio Apr 16 at 16:07

dboles99 commented Aug 13, 2015 This might sound bad, but is the project directory the top directory (~/KALBON1.0.0.0) or is it the (~/KALBON1.0.0.0/src) directory? Terms Privacy Security Status Help You can't perform that action at this time. How can I claim compensation? Cannot Open Output File Function Not Implemented Already have an account?

Make sure that you are building either from a Git working tree or from a source archive. [ 40%] Built target version [ 40%] Built target epee [ 40%] Built target How good should one be to participate in PS? What is the most someone can lose the popular vote by but still win the electoral college? diff -r 1b7c5daffdff src/cmd/gc/go.h --- a/src/cmd/gc/go.h Mon Jan 06 16:11:58 2014 -0500 +++ b/src/cmd/gc/go.h Mon Jan 06 22:23:04 2014 -0500 @@ -78,7 +78,7 @@ struct Strlit { int32 len; - char

This value is not required and setting it will cause a reoccurance of this issue in the future. Cannot Open Output File 7zip fail Might not be really needed. Bug? It seems to working.

  1. Can a president win the electoral college and lose the popular vote How to stop NPCs from picking up dropped items Scheduling a task into a period within a day, depending
  2. zman0900 commented on 2015-08-10 21:11 Old maintainer seems to be missing so I went ahead and took this over since I already have tvheadend-atsc-epg-git.
  3. How to reply?
  4. But I modified the package to use the systemd service file that is provided by tvheadend people.

/usr/bin/ld Cannot Open Output File Is A Directory

Personal Open source Business Explore Sign up Sign in Pricing Blog Support Search GitHub This repository Watch 1,852 Star 21,917 Fork 2,889 golang/go Code Issues 2,392 Pull requests 1 Projects The 404 error also only happens with the "static" / tvh provided ffmpeg and seems to be harmless. /usr/bin/ld Cannot Open Output File Permission Denied TSA broke a lock for which they have a master key. Ld Cannot Open Output File No Such File Or Directory You signed in with another tab or window.

Make sure your system is fully up to date then try deleting /tmp/yaourt-tmp-$USER and install again. http://bovbjerg.net/cannot-open/usr-bin-ld-cannot-open-output-file-no-such-file-or-directory.php If it doesn't error and you get into a subdirectory called test, then the problem is exactly what the error message says. Vent kitchen hood vent to roof turbine vent? When building from github dot com/assimp/assimp2json, the error "/usr/bin/ld: cannot open output file assimp2json: Is a directory" is produced. /usr/bin/ld Cannot Open Output File No Such File Or Directory

You signed in with another tab or window. My complete build process listing: ~/software/ecto-tests$ tree . ├── CMakeLists.txt ├── hello.cpp ├── hello.py └── tutorial.cpp 0 directories, 4 files ~/software/ecto-tests$ mkdir build ~/software/ecto-tests$ cd build/ ~/software/ecto-tests/build$ cmake ../ -- The I've set up a shared folder with a few c programs and when I go to compile in Ubuntu, such as: gcc file.c -o fileTest I get the following error: /usr/bin/ld: weblink LoginPreferencesHelp/Guide View TicketsWiki Context Navigation ← Previous TicketNext Ticket → Opened at 2010-05-04T09:47:17+01:00 Closed at 2010-05-16T01:47:50+01:00 #9167 closed Bugs (Fixed) Compiling issue: cannot open output file visualization.goom/Goom.vis: No such file or

This makes a bit of progress, but not enough: " Linking CXX shared library ../../lib/libassimp.so [ 80%] Built target assimp Scanning dependencies of target assimp2json [ 80%] Building CXX object CMakeFiles/assimp2json.dir/assimp2json/main.cpp.o Collect2: Error: Ld Returned 1 Exit Status In the make manual I can not find an option to change the output path. If so, my successful install must have been against the previous one.

more hot questions question feed about us tour help blog chat data legal privacy policy work here advertising info mobile contact us feedback Technology Life / Arts Culture / Recreation Science

However I'm still getting the following error on my Raspberry Pi 2: "Unable to invoke compiler: arm-none-linux-gnueabi-gcc -D_LARGEFILE_SOURCE -D_FILE_OFFSET_BITS=64" zman0900 commented on 2016-03-14 10:19 For the "CSA" tab, I have never This allow building specs in release mode in a much faster way. p.s. Collect2 Ld Returned 1 Exit Status Where does the build() that was mentioned come in?

assimp/test/CMakeFiles/unit.dir/build.make:77: recipe for target 'assimp/test/CMakeFiles/unit.dir/unit/Main.cpp.o' failed make[2]: *** [assimp/test/CMakeFiles/unit.dir/unit/Main.cpp.o] Error 1 CMakeFiles/Makefile2:250: recipe for target 'assimp/test/CMakeFiles/unit.dir/all' failed make[1]: *** [assimp/test/CMakeFiles/unit.dir/all] Error 2 Makefile:117: recipe for target 'all' failed make: *** [all] Terms Privacy Security Status Help You can't perform that action at this time. cryptonotefoundation closed this Aug 17, 2015 Sign up for free to join this conversation on GitHub. check over here Sign up for free to subscribe to this conversation on GitHub.

Does Intel sell CPUs in ribbons? checking for cc libdvben50221 ... sudo rm -rf /usr/local/go 2. Terms Privacy Security Status Help You can't perform that action at this time.

This uses 'git', the version control software, of which you can add code to from linux command line. Just guessing here. As github dot com/assimp/assimp2json is forked from github dot com/acgessler/assimp2json which has more recent commits (2013 vs. 2015), I also tried building that with the same commands. I'm using OS X 10.8.5 and Xcode 4, but I can't reproduce the compilation error at tip.

Bug? Limit computation technology in a futuristic society How can I open the next/previous file alphabetically? slashme commented on 2016-04-01 12:53 It seems like --disable-libffmpeg_static was renamed to --disable-ffmpeg_static, and --disable-libvpx_static, --disable-libtheora_static, --disable-libvorbis_static and --disable-libfdkaac_static were added. Changed at 2010-05-06T11:46:31+01:00 by erhnam Attachment patch.txt​ added Changed at 2010-05-06T11:46:53+01:00 by erhnam Attachment patch.patch​ added comment:2 in reply to: ↑ 1 Changed at 2010-05-06T13:54:13+01:00 by erhnam Replying to w1ll14m: confirmed: Copying