Home > Cannot Find > Usr Bin Ld Cannot Find Ldb2

Usr Bin Ld Cannot Find Ldb2

Contents

Arch Linux HomePackagesForumsWikiBugsAURDownload Index Rules Search Register Login You are not logged in. US Election results 2016: What went wrong with prediction models? Screenshot instructions: Windows Mac Red Hat Linux Ubuntu Click URL instructions: Right-click on ad, choose "Copy Link", then paste here → (This may not be possible with some types of This is most likely a problem with the ibm_db package, 2015-08-10T22:55:40.02+0200 [STG/0] OUT npm ERR! navigate here

I thought to actually check the help text for the ld command: ld --help From that, I figured out how to run ld in verbose mode (imagine that): ld -lzlib --verbose Please don't fill out this field. Commenting out these extensions and installing the 'devel' version of ibm_db2 seems to have fixed this problem. npm owner ls ibm_db 2015-08-10T22:55:40.02+0200 [STG/0] OUT npm ERR!

Cannot Find Ubuntu

I had put my extra library in /opt/lib so I did: $ export LIBRARY_PATH=/opt/lib/ and then ran make for successful compilation and linking. Is your Perl also a 64-bit version? What do I do? node -v v0.10.40 2015-08-10T22:55:40.02+0200 [STG/0] OUT npm ERR!

  • If so, try removing it.
  • question on whether to /usr/etc/disk -i or /bin/rm -fr an Optical Disk 8.
  • How to capture disk usage percentage of a partition as an integer?
  • Best regards, Michele I copy below a part of the cf logs <> --recent output: 2015-08-10T22:54:25.31+0200 [API/7] OUT Updated app with guid 014c487b-0299-4ad0-b43c-85ffaa20adf9 ({"state"=>"STARTED"}) 2015-08-10T22:54:25.43+0200 [STG/107] OUT -----> Downloaded app package
  • Thanks for your help.
  • You can not post a blank message.

Will I get the same result if I use 18-55mm lens at 55mm (full zoom) and 55-200mm lens at 55mm (no zoom), if not, then why? Use 'CC -flags' for details *** Error code 1 dmake: Fatal error: Command failed for target `lxxglrep' I review the parameters and they seem to be ok, but I cannot find Why does top 50% need a -50% translate offset? Usr Bin Ld Cannot Find Caffe Using DB2 in "/home/db2inst1/sqllib" .... [no errors] $ make cp DB2.pm blib/lib/DBD/DB2.pm cp lib/Bundle/DBD/DB2.pm blib/lib/Bundle/DBD/DB2.pm ....

Please advise John **************************************************** This e-mail message and all attachments transmitted with it may contain legally privileged and/or confidential information intended solely for the use of the addressee. Cannot Find Linux How does Gandalf end up on the roof of Isengard? Tags Spaces API Connect Appsecdev BPM Blockchain Bluemix CICS Cloud Analytics Cloud marketplace Content Services (ECM) Continuous Testing Courses DB2 LUW DataPower Decision Optimization DevOps Services Digital Experience Hadoop IBM Design I'm trying to install from ruby-db2-0.4.4 ruby setup.rb config setup.rb:714: warning: don't put space before argument parentheses entering config phase...

c++ linux g++ share|improve this question edited Feb 27 at 0:44 Sean M 34412 asked May 23 '13 at 9:20 ZoOo 838265 Need more info. Ld: Warning: Cannot Find Entry Symbol _start; Not Setting Start Address Should be export LD_LIBRARY_PATH=$LD_LIBRARY_PATH:/your/path. (Unfortunately, stubborn SO refuses to accept an edit with <6 characters, WTF…) –ThomasR Mar 12 at 20:33 @ThomasR Thank you! Re: Does anybody have linking problems? 3138207 Feb 22, 2016 9:35 AM (in response to 3138207) Thank you Steve for your answer. not ok 2015-08-10T22:55:33.98+0200 [STG/0] OUT ] killed: false, code: 1, signal: null } 2015-08-10T22:55:34.03+0200 [STG/0] OUT > [email protected] install /tmp/staged/app/node_modules/node-red/node_modules/bcrypt 2015-08-10T22:55:34.03+0200 [STG/0] OUT > node-gyp rebuild 2015-08-10T22:55:34.81+0200 [STG/0] OUT make: Entering

Cannot Find Linux

The Makefile I had was only expecting static libraries so it used -Wl,-Bstatic. Please type your message and try again. Cannot Find Ubuntu cwd /tmp/staged/app 2015-08-10T22:55:40.02+0200 [STG/0] OUT npm ERR! /usr/bin/ld Cannot Find Library Just because you can create a simple standalone program does not show that your compilation options are compatible with Perl's, but it greatly increases your chances of success, and eliminates whole

First of all thanks for reading this post.I'm compiling on this directory: /home/garcantb/r7.3/common/gl/I got to compile the whole code without any problem (no errors), but when I try to link with http://bovbjerg.net/cannot-find/usr-bin-ld-cannot-find-lc.php Why is the 'You talking to me' speech from the movie 'Taxi Driver' so famous? Find a mistake in the following bogus proof Forcing everyone to speak the same language more hot questions question feed about us tour help blog chat data legal privacy policy work Re: Does anybody have linking problems? Cannot Find Lcudart

The library file is located somewhere other than /usr/lib/ (even sub-directories of /usr/lib). I want to link my -lARToolkitPlus flag to a path. –Shashwat Sep 18 '14 at 11:40 add a comment| up vote 0 down vote This error may also be brought about Browse other questions tagged linux db2 rhel pecl or ask your own question. http://bovbjerg.net/cannot-find/usr-bin-cannot-find-lcv.php Have you ever been able to connect to DB2 using the DB2 Connect = software?

HD Problems/Dos is gone. 5. /usr/ccs/bin/ld: accountProfile.o: Mismatched ABI. 64-bit PA object file found in 32-bit link. 6. Usr Bin Ld Cannot Find Collect2 Ld Returned 1 Exit Status Re: Does anybody have linking problems? How to stop NPCs from picking up dropped items MathSciNet review alert?

https://github.com/ibmdb/node-ibm_db/issues/52 This is fixed now.

Does an Eldritch Knight's war magic allow Extra Attacks? I understand that I can withdraw my consent at any time. Please advise John **************************************************** This e-mail message and all attachments transmitted with it may contain legally privileged and/or confidential information intended solely for the use of the addressee. Gcc Cannot Find How can I claim compensation?

Please don't fill out this field. Show 4 replies 1. Register here. http://bovbjerg.net/cannot-find/usr-bin-ld-cannot-find.php stack at ChildProcess.emit (events.js:98:17) 2015-08-10T22:55:33.98+0200 [STG/0] OUT gyp ERR!

Which version do you have installed? Steve.Clamage-Oracle Feb 22, 2016 5:44 PM (in response to 3138207) A CC command must specify at least one source or object file to process. gcc 4.1.2. I copied the contents of the C++ test script into a new file, and tried to compile it from the command line: sqlrelay-0.53.1]$ g++ -o conftest -I/opt/ibm/db2/V9.7/include test.cpp -L/opt/ibm/db2/V9.7/lib32 -ldb2 /usr/bin/ld:

Teenage daughter refusing to go to school How to handle a common misconception when writing a Master's thesis? We had a 64-bit install, but then a 32-bit = patch. >> As part of the db2iupdt process one needs to specify 64-bit, I'm told = by >> my DBA. (RoT In those cases, you could create a link from them and name them exactly: lib{name of library}.so and place it in /usr/lib/. Does the problem come from that? –ZoOo May 23 '13 at 9:41 3 @ZoOo that shouldn't normally matter, the linker can work with either one –djf May 23 '13 at

Comments to Ask Bjørn Hansen at [email protected] | Group listing | About Very Computer Board index Perl /usr/bin/ld: cannot find -ldb2 /usr/bin/ld: cannot find -ldb2 by John Hans » Sat, 19 Exit status 1 2015-08-10T22:55:40.02+0200 [STG/0] OUT npm ERR! 2015-08-10T22:55:40.02+0200 [STG/0] OUT npm ERR! Join them; it only takes a minute: Sign up usr/bin/ld: cannot find -l up vote 167 down vote favorite 50 I'm trying to compile my program and it returns this error Friedman wrote: > > Hi, help appreciated.

Please enter a title. g++ -g -c prix_construct_sequences.cc -I. -I/home/nico/prix/h -I/home/nico/bdb/include g++ -g -o prix_construct_sequences prix_construct_sequences.o -I/home/nico/prix/h g++ -g -c prix_indexer.cc -I. -I/home/nico/prix/h -I/home/nico/bdb/include g++ -g -c helper.cc -I. I made no change on the original code or options. My library is a symbolic link, i think the problem come from that because when i use the library in the other directory it works ! –ZoOo May 23 '13 at

cwd /tmp/staged/app/node_modules/node-red-nodes-cf-sqldb-dashdb/node_modules/ibm_db 2015-08-10T22:55:33.98+0200 [STG/0] OUT gyp ERR! I read the README and CAVEATS and did not see a > solution to this. > > $ uname -a > Linux vmddbm302.storeperform.com 2.6.9-22.0.1.ELsmp #1 SMP Tue Oct 18 > 18:39:02 The author of PRIX says that I didn't install BDB with C++ support, but even after I uninstalled & reconfigured BDB with "../dist/configure --enable-cxx", I still encountered the same problem. I read the README and CAVEATS and did not see a solution to this. $ uname -a Linux vmddbm302.storeperform.com 2.6.9-22.0.1.ELsmp #1 SMP Tue Oct 18 18:39:02 EDT 2005 x86_64 x86_64 x86_64

You can use make -n your-target to have make just print the commands it would normally invoke –djf May 23 '13 at 9:26 Post the makefile or the command There is likely additional logging output above. 2015-08-10T22:55:40.02+0200 [STG/0] OUT npm ERR! System Linux 3.13.0-39-generic 2015-08-10T22:55:40.02+0200 [STG/0] OUT npm ERR! Error message in BIND 9.