Home > Cannot Find > Usr/bin/ld Cannot Find Lboost_system

Usr/bin/ld Cannot Find Lboost_system

Contents

Browse other questions tagged c++ linux g++ or ask your own question. By now we know that static linkage fails on Mac OS X and Cent OS. the error for "cannot find -lboost_system-mgw46-mt-sd-1_53" means ld is looking for libboost_system-mgw46-mt-sd-1_53). I then installed the libs using bjam install. http://bovbjerg.net/cannot-find/usr-bin-ld-cannot-find-lboost-system-mt.php

I already tried to downgrade Boost to version 1_54, but I don't have an older version and I think it should compile fine with a newer version without any problems. dselivanov commented Dec 24, 2015 Linking CXX executable bigartm /usr/bin/ld: cannot find -lpthread /usr/bin/ld: cannot find -lstdc++ /usr/bin/ld: cannot find -lm /usr/bin/ld: cannot find -lpthread /usr/bin/ld: cannot find -lc collect2: error: Basic Geometric intuition, context is undergraduate mathematics How do I deal with my current employer not respecting my decision to leave? You signed out in another tab or window.

Cannot Find Lboost_filesystem

Missing } inserted. \int dx = x + C & How can the US electoral college vote be so different to the popular vote? Can you dispel a magic effect you can't perceive? more hot questions question feed about us tour help blog chat data legal privacy policy work here advertising info mobile contact us feedback Technology Life / Arts Culture / Recreation Science Basic Geometric intuition, context is undergraduate mathematics QGIS Print composer scale problems What Could Cause Flash Over / Arcing to Reappear on New Plugs?

Not sure how that could have happened unless you installed them explicitly (including the ":i386" on the package name at installation. I'm running Ubuntu Jaunty 9.04 I recently tried to install 0 A.D. (rts game). Reload to refresh your session. Undefined Reference To `boost::system::system_category()' code like #include using namespace std; #include #include int main(){ cout<<"hello"<("123456"); cout<<"boost "<

Download in other formats: Comma-delimited Text Tab-delimited Text RSS Feed Powered by Trac 0.12.2 By Edgewall Software. Top Xplorer4x4 Posts: 4 Joined: 2011/12/04 08:58:56 Re: Can not find lboost_system Quote Postby Xplorer4x4 » 2011/12/05 15:39:45 markkuk wrote:Install boost141-system. Not the answer you're looking for? Why were pre-election polls and forecast models so wrong about Donald Trump?

Find a mistake in the following bogus proof How do I deal with my current employer not respecting my decision to leave? Libboost-all-dev share|improve this answer answered Sep 17 '14 at 15:58 sdaau 13.4k19108162 add a comment| up vote 1 down vote change libboost_thread-mt to libboost_thread, first find the address of libboost_thread.so and libboost_thread.a Is there an actual army in 1984? Make sure you check the path with -L with command, ld -L -l --verbose –spidy Mar 9 '15 at 20:09 1 @EdwardBlack See this answer.

Caffe Usr Bin Ld Cannot Find

vim -c help42 Adv Reply Quick Navigation General Help Top Site Areas Settings Private Messages Subscriptions Who's Online Search Forums Forums Home Forums The Ubuntu Forum Community Ubuntu Official Flavours Try passing -lboost_system instead of -lboost_system-mt Edit: Also it's good to check if the new libs are really inside /usr/local/lib. Cannot Find Lboost_filesystem What Could Cause Flash Over / Arcing to Reappear on New Plugs? Usr Bin Ld Cannot Find Collect2 Error Ld Returned 1 Exit Status sashafrey commented Dec 24, 2015 Hm..

The software referencing the libraries was written by someone else, and reference Boost with the -mt suffix. http://bovbjerg.net/cannot-find/vbscript-run-the-system-cannot-find-the-file-specified.php However, when I searched the /usr/lib-folder I got more results - the missing files were all in the /usr/lib/arm-linux-gnueabihf-folder. The solution you found worked. Join them; it only takes a minute: Sign up usr/bin/ld: cannot find -l up vote 167 down vote favorite 50 I'm trying to compile my program and it returns this error Cannot Find Lboost_thread

Am I missing sometihing? What episode of Star Trek is this creature on? Thank you –José Trinidad Soto Mar 8 at 18:57 Amm, no, is 64 bit, uname -a displays x86_64 –José Trinidad Soto Mar 8 at 20:46 Hi, ubfan, his comment is here share|improve this answer answered Jun 17 at 12:09 Vzbux 1 add a comment| up vote 0 down vote The library I was trying to link to turned out to have a

Possible repercussions from assault between coworkers outside the office Does an Eldritch Knight's war magic allow Extra Attacks? Error While Loading Shared Libraries Ask Ubuntu works best with JavaScript enabled UbuntuCommunityAsk!DeveloperDesignDiscourseHardwareInsightsJujuShopMore ›AppsHelpForumLaunchpadMAASCanonical current community chat Ask Ubuntu Ask Ubuntu Meta your communities Sign up or log in to customize your list. We recommend upgrading to the latest Safari, Google Chrome, or Firefox.

Secondly, sorry I am not the most advanced user, could you be more specific as to what exactly I need to modify?Yes, you must tell the compiler and linker where to

  • If you look in the Makefile you should find a line somewhere that has LIBS += -lboost_system-mgw46-mt-sd-1_53 -lboost_filesystem-mgw46-mt-sd-1_53 -lboost_program_options-mgw46-mt-sd-1_53 -lboost_thread-mgw46-mt-sd-1_53Essentially you can see from the output of "make that" it's looking
  • I was avoiding installing that package until I saw this post.
  • How does Gandalf end up on the roof of Isengard?
  • In a terminal, run uname -a to see if your OS is 32 bit or 64 bit (X86_64 indicates 64 bit).
  • thank you.

I receive the following errors: Linking AtlasUI /usr/bin/ld: cannot find -lboost_system-mt collect2: ld returned 1 exit status make[1]: *** [../../../binaries/system/libAtlasUI_dbg.so] Error 1 make: *** [AtlasUI] Error 2 make: *** Waiting for It seems that the mt libraries are no longer part of the library - or am I missing something? It contains static analogues for boost dynamic libraries. Ld_library_path I came across another post on the Internets that suggested to run make with LD_DEBUG=all: LD_DEBUG=all make Although I got a TON of debugging output, it wasn't actually helpful.

dselivanov commented Dec 24, 2015 I'm on 10.10 :-) there always issues on new systems :-) 24 дек. 2015 г. 8:06 PM пользователь "sashafrey" написал: … Hm.. Should be export LD_LIBRARY_PATH=$LD_LIBRARY_PATH:/your/path. (Unfortunately, stubborn SO refuses to accept an edit with <6 characters, WTF…) –ThomasR Mar 12 at 20:33 @ThomasR Thank you! libpthread.so you are already linking with). –Ortwin Angermeier May 23 '13 at 10:10 1 The problem was on my symbolic link on the library which wasn't good ! weblink I'm fairly sure someone reported a similar issue on latest Mac OS X (presumably 10.11.1).

You need to edit your first post to add [solved] to the thread title. Is it possible for a diesel engine computer to detect (and prevent) a runaway condition? sashafrey commented Dec 24, 2015 before closing let's discuss whether we should set static linkage to OFF by default. @romovpa @JeanPaulShapo What do you think? dselivanov commented Dec 25, 2015 @JeanPaulShapo thx, now it works fine with static linker.

I forgot to write the line 'sudo apt-get install libboost-dev'. If so, try removing it. boost packages) neither in README nor in documentation . Bug?