Home > Cannot Execute > Usr/bin/libtool Cannot Execute Binary File

Usr/bin/libtool Cannot Execute Binary File

Contents

not bison checking for flex... Go to "Xcode" :: "Preferences" :: "Downloads" :: "Components" where there should be an install Command Line Tools. checking whether we are cross compiling... Main Menu LQ Calendar LQ Rules LQ Sitemap Site FAQ View New Posts View Latest Posts Zero Reply Threads LQ Wiki Most Wanted Jeremy's Blog Report LQ Bug Syndicate Latest navigate here

Please visit this page to clear all LQ-related cookies. The question does not have to be directly related to Linux and any language is fair game. objdump checking how to recognize dependent libraries... Already have an account?

Cannot Execute Binary File In Linux Error

ok checking for sysroot... Should I report it? I am able to do most of required and failed at last step. Is it possible to hand start modern planes?

  1. NevemTeve View Public Profile View LQ Blog View Review Entries View HCL Entries Find More Posts by NevemTeve 03-02-2016, 10:18 AM #3 pan64 LQ Guru Registered: Mar 2012 Location:
  2. Doing that will get the tools into /usr/bin - which is already in your PATH.
  3. vBulletin ©2000 - 2016, Jelsoft Enterprises Ltd.
  4. Blogs Recent Entries Best Entries Best Blogs Blog List Search Blogs Home Forums HCL Reviews Tutorials Articles Register Search Search Forums Advanced Search Search Tags Search LQ Wiki Search Tutorials/Articles Search
  5. share|improve this answer answered Jun 13 '12 at 1:27 RidDeBakTiYar 163229 add a comment| up vote 4 down vote I'm making some wild guesses here, but it looks like the following
  6. libtoolize: copying file `config/ltmain.sh' libtoolize: putting macros in AC_CONFIG_MACRO_DIR, `config/m4'.

when you build an app you must not use the -c flag, so gcc ${CFLAGS} ${LDFLAGS} -o [email protected] -c main.c will never (unable to) create an executable 1 members found yes checking whether to build shared libraries... more stack exchange communities company blog Stack Exchange Inbox Reputation and Badges sign up log in tour help Tour Start here for a quick overview of the site Help Center Detailed Cannot Execute Binary File Ubuntu Last edited by chakka.lokesh; 03-02-2016 at 10:09 AM.

Because your $PATH is not set, bash is only able to run commands with the full path specified. Basic Geometric intuition, context is undergraduate mathematics why does this error keep popping out? And no need to do chmod as well. I've installed the gcc and gfortran libraries too.

Is there an actual army in 1984? Cannot Execute Binary File Exec Format Error Cygwin My Documents wnoguchi's Gists My Tips and Snippets shortcuts. pan64 View Public Profile View LQ Blog View Review Entries View HCL Entries Find More Posts by pan64 03-03-2016, 04:04 AM #4 chakka.lokesh Member Registered: Mar 2008 Distribution: Ubuntu more hot questions question feed about us tour help blog chat data legal privacy policy work here advertising info mobile contact us feedback Technology Life / Arts Culture / Recreation Science

Cannot Execute Binary File Exec Format Error Ubuntu

When this is set, cross compiled glib-genmarshall is detected which causes the error: >>/home/mike/embedded/GUI/glib-2.0.6/gobject/.libs/lt-glib-genmarshal: >>cannot execute binary file 1) Natively compile first the glib to the PC. binary file not executable. Cannot Execute Binary File In Linux Error Makefile.am: installing `config/depcomp' configure.ac: installing `config/ylwrap' autoreconf: automake failed with exit status: 1 Libtool γ‚’ε…₯γ‚Œγ‚‹γ€‚ sudo apt-get -y install libtool ε†εΊ¦γƒˆγƒ©γ‚€γ€‚ [email protected] ~/jq $ autoreconf -i libtoolize: putting auxiliary files in Cannot Execute Binary File Mac Why does Cutie act like this and lesser robots listen to it?

So, until they fix it, let's talk workarounds. check over here EDIT: You can download from here: http://www.ubuntu.com/download/deskt...tive-downloads Best, Gnusci "Never make a calculation until you know the answer." -- Wheeler, Spacetime Physics, pg 60. Find the "unwrapped size" of a list Why do some banks have more than one routing number in the US? none needed checking dependency style of gcc... Cannot Execute Binary File Java

flex ε…₯γ‚Œγ‚‹γ€‚ sudo apt-get -y install flex builtin.c:4:23: fatal error: oniguruma.h: No such file or directory compilation terminated. This is free software; see the source for copying conditions. yes checking if gcc -std=gnu99 supports -c -o file.o... http://bovbjerg.net/cannot-execute/usr-bin-ld-cannot-execute-binary-file.php Powered by MailMan current community chat Stack Overflow Meta Stack Overflow your communities Sign up or log in to customize your list.

e.g. Java Cannot Execute Binary File: Exec Format Error Index(es): Date Thread Wireshark and the "fin" logo are registered trademarks of the Wireshark Foundation Back to top Or, if you prefer, set up a "maintenance user-id," in its own group, and give ownership of the directory to that user.

If a program is doing a "default search" for a library, it will only find that library if the loader cache contains the location and the cache contents are up-to-date.

This book contains many real life examples derived from the author's experience as a Linux system and network administrator, trainer and consultant. yes checking for bundle... How does Gandalf end up on the roof of Isengard? Bash Cannot Execute Binary File Ubuntu Will I get the same result if I use 18-55mm lens at 55mm (full zoom) and 55-200mm lens at 55mm (no zoom), if not, then why?

Join them; it only takes a minute: Sign up Error: Can't run /Applications/Xcode.app/Contents/Developer/Platforms/MacOSX.platform/Developer/usr/bin/ibtool (no such file) up vote 5 down vote favorite 3 I'm trying to use ibtool for iOS development strace ./nre. yes checking for _isatty... http://bovbjerg.net/cannot-execute/usr-bin-ssh-cannot-execute-binary-file.php LinuxQuestions.org > Forums > Non-*NIX Forums > Programming [SOLVED] cannot execute binary file: Exec format error User Name Remember Me?

Proceed to next step. sundialsvcs View Public Profile View LQ Blog View Review Entries View HCL Entries Visit sundialsvcs's homepage! From: H Aslam Re: [Wireshark-users] Crosscompiling TSHARK to run on embedded linux on ppc440! but if I do /usr/local/bin/hello it is giving the following error: Quote: $ hello hello: error while loading shared libraries: libhello.so.0: cannot open shared object file: No such file or directory

Fetch Bug? Nothing else. –superuser Jun 12 '12 at 21:33 3 PATH is an environment variable which contains a list of folders which the shell searches for programs. configure: error: cannot find > > output from flex; giving up> > Do you have the config.log file generated by the configure script?> > If so, what comes after the first From: H Aslam Re: [Wireshark-users] Crosscompiling TSHARK to run on embedded linux on ppc440!